black belt-n
type: LexicalEntry
canonical form: black belt
sense: 07282871-n
part of speech: noun

07282871-n
type: LexicalConcept
in scheme: en-word.net
definition: a black sash worn to show expert standards in the martial arts (judo or karate)
ili: i74879
lexfile: noun.communication
part of speech: noun
hypernym: 06895611-n