horn-n
type: LexicalEntry
canonical form: horn
sense: 07280214-n
part of speech: noun

07280214-n
type: LexicalConcept
in scheme: en-word.net
definition: a noise made by the driver of an automobile to give warning
ili: i74858
lexfile: noun.communication
part of speech: noun
hypernym: 06816015-n