elucidation-n
type: LexicalEntry
canonical form: elucidation
sense: 07247315-n
part of speech: noun

07247315-n
type: LexicalConcept
in scheme: en-word.net
definition: an act of explaining that serves to clear up and cast light on
ili: i74675
lexfile: noun.communication
part of speech: noun
hypernym: 07247081-n