ringing-n
type: LexicalEntry
canonical form: ringing
sense: 07243191-n
part of speech: noun

07243191-n
type: LexicalConcept
in scheme: en-word.net
definition: the giving of a ring as a token of engagement
ili: i74649
lexfile: noun.communication
part of speech: noun
hypernym: 07242871-n