report card-n
type: LexicalEntry
canonical form: report card
sense: 07234960-n
part of speech: noun

report-n
type: LexicalEntry
canonical form: report
sense: 07234960-n
part of speech: noun

07234960-n
type: LexicalConcept
in scheme: en-word.net
definition: a written evaluation of a student's scholarship and deportment
example: his father signed his report card
ili: i74604
lexfile: noun.communication
part of speech: noun
hypernym: 06646883-n