assay-n
type: LexicalEntry
canonical form: assay
sense: 07233822-n
part of speech: noun

07233822-n
type: LexicalConcept
in scheme: en-word.net
definition: a written report of the results of an analysis of the composition of some substance
ili: i74596
lexfile: noun.communication
part of speech: noun
hypernym: 07233130-n