stipulation-n
type: LexicalEntry
canonical form: stipulation
sense: 07231421-n
part of speech: noun

judicial admission-n
type: LexicalEntry
canonical form: judicial admission
sense: 07231421-n
part of speech: noun

07231421-n
type: LexicalConcept
in scheme: en-word.net
definition: (law) an agreement or concession made by parties in a judicial proceeding (or by their attorneys) relating to the business before the court; must be in writing unless they are part of the court record
example: a stipulation of fact was made in order to avoid delay
ili: i74584
lexfile: noun.communication
part of speech: noun
domain topic: 08458195-n
hypernym: 07231072-n