denial-n
type: LexicalEntry
canonical form: denial
sense: 07218900-n
part of speech: noun

disaffirmation-n
type: LexicalEntry
canonical form: disaffirmation
sense: 07218900-n
part of speech: noun

07218900-n
type: LexicalConcept
in scheme: en-word.net
definition: the act of asserting that something alleged is not true
ili: i74514
lexfile: noun.communication
part of speech: noun
hypernym: 06742248-n