margin call-n
type: LexicalEntry
canonical form: margin call
sense: 07207321-n
part of speech: noun

call-n
type: LexicalEntry
canonical form: call
sense: 07207321-n
part of speech: noun

07207321-n
type: LexicalConcept
in scheme: en-word.net
definition: a demand by a broker that a customer deposit enough to bring their margin up to the minimum requirement
ili: i74455
lexfile: noun.communication
part of speech: noun
hypernym: 07205939-n