gap-n
type: LexicalEntry
canonical form: gap
sense: 07198513-n
part of speech: noun

07198513-n
type: LexicalConcept
in scheme: en-word.net
definition: a difference (especially an unfortunate difference) between two opinions or two views or two situations
ili: i74405
lexfile: noun.communication
part of speech: noun
hypernym: 07196595-n