confrontation-n
type: LexicalEntry
canonical form: confrontation
sense: 07196373-n
part of speech: noun

07196373-n
type: LexicalConcept
in scheme: en-word.net
definition: discord resulting from a clash of ideas or opinions
ili: i74394
lexfile: noun.communication
part of speech: noun
hypernym: 07196206-n