interpretation-n
type: LexicalEntry
canonical form: interpretation
sense: 07185404-n
part of speech: noun

07185404-n
type: LexicalConcept
in scheme: en-word.net
definition: an explanation that results from interpreting something
example: the report included his interpretation of the forensic evidence
ili: i74338
lexfile: noun.communication
part of speech: noun
hypernym: 06751030-n