submission-n
type: LexicalEntry
canonical form: submission
sense: 07182229-n
part of speech: noun

entry-n
type: LexicalEntry
canonical form: entry
sense: 07182229-n
part of speech: noun

07182229-n
type: LexicalConcept
in scheme: en-word.net
definition: something (manuscripts or architectural plans and models or estimates or works of art of all genres etc.) submitted for the judgment of others (as in a competition)
example: several of his submissions were rejected by publishers
example: what was the date of submission of your proposal?
ili: i74320
lexfile: noun.communication
part of speech: noun
hypernym: 06611268-n