proposal-n
type: LexicalEntry
canonical form: proposal
sense: 07176845-n
part of speech: noun

07176845-n
type: LexicalConcept
in scheme: en-word.net
definition: something proposed (such as a plan or assumption)
ili: i74292
lexfile: noun.communication
part of speech: noun
hypernym: 06611268-n