proposition-n
type: LexicalEntry
canonical form: proposition
sense: 07176563-n
part of speech: noun

07176563-n
type: LexicalConcept
in scheme: en-word.net
definition: an offer for a private bargain (especially a request for sexual favors)
ili: i74290
lexfile: noun.communication
part of speech: noun
hypernym: 07179197-n