recognition-n
type: LexicalEntry
canonical form: recognition
sense: 07163815-n
part of speech: noun

07163815-n
type: LexicalConcept
in scheme: en-word.net
definition: the explicit and formal acknowledgement of a government or of the national independence of a country
example: territorial disputes were resolved in Guatemala's recognition of Belize in 1991
ili: i74232
lexfile: noun.communication
part of speech: noun
hypernym: 07163281-n