exchange-n
type: LexicalEntry
canonical form: exchange
sense: 07149414-n
part of speech: noun

07149414-n
type: LexicalConcept
in scheme: en-word.net
definition: a mutual expression of views (especially an unpleasant one)
example: they had a bitter exchange
ili: i74156
lexfile: noun.communication
part of speech: noun
hypernym: 07148409-n