vowel system-n
type: LexicalEntry
canonical form: vowel system
sense: 07128611-n
part of speech: noun

vocalism-n
type: LexicalEntry
canonical form: vocalism
sense: 07128611-n
part of speech: noun

07128611-n
type: LexicalConcept
in scheme: en-word.net
definition: the system of vowels used in a particular language
ili: i74043
lexfile: noun.communication
part of speech: noun
hypernym: 07127900-n