climax-n
type: LexicalEntry
canonical form: climax
sense: 07117039-n
part of speech: noun

07117039-n
type: LexicalConcept
in scheme: en-word.net
definition: arrangement of clauses in ascending order of forcefulness
ili: i73983
lexfile: noun.communication
part of speech: noun
hypernym: 07112859-n