dactyl-n
type: LexicalEntry
canonical form: dactyl
sense: 07109814-n
part of speech: noun

07109814-n
type: LexicalConcept
in scheme: en-word.net
definition: a metrical unit with stressed-unstressed-unstressed syllables
ili: i73937
lexfile: noun.communication
part of speech: noun
hypernym: 07109509-n