sensationalism-n
type: LexicalEntry
canonical form: sensationalism
sense: 07102245-n
part of speech: noun

luridness-n
type: LexicalEntry
canonical form: luridness
sense: 07102245-n
part of speech: noun

07102245-n
type: LexicalConcept
in scheme: en-word.net
definition: the journalistic use of subject matter that appeals to vulgar tastes
example: the tabloids relied on sensationalism to maintain their circulation
ili: i73899
lexfile: noun.communication
part of speech: noun
hypernym: 07085290-n