pop music-n
type: LexicalEntry
canonical form: pop music
sense: 07074002-n
part of speech: noun

pop-n
type: LexicalEntry
canonical form: pop
sense: 07074002-n
part of speech: noun

07074002-n
type: LexicalConcept
in scheme: en-word.net
definition: music of general appeal to teenagers; a bland watered-down version of rock'n'roll with more rhythm and harmony and an emphasis on romantic love
ili: i73786
lexfile: noun.communication
part of speech: noun
hypernym: 07073295-n