refrain-n
type: LexicalEntry
canonical form: refrain
sense: 07064217-n
part of speech: noun

chorus-n
type: LexicalEntry
canonical form: chorus
sense: 07064217-n
part of speech: noun

07064217-n
type: LexicalConcept
in scheme: en-word.net
definition: the part of a song where a soloist is joined by a group of singers
ili: i73720
lexfile: noun.communication
part of speech: noun
hypernym: 07034009-n