intro-n
type: LexicalEntry
canonical form: intro
sense: 07059303-n
part of speech: noun

07059303-n
type: LexicalConcept
in scheme: en-word.net
definition: a brief introductory passage to a piece of popular music
ili: i73688
lexfile: noun.communication
part of speech: noun
hypernym: 07058663-n