theme song-n
type: LexicalEntry
canonical form: theme song
sense: 07042451-n
part of speech: noun

07042451-n
type: LexicalConcept
in scheme: en-word.net
definition: a melody that recurs and comes to represent a musical play or movie
ili: i73589
lexfile: noun.communication
part of speech: noun
hypernym: 07041860-n