preparation-n
type: LexicalEntry
canonical form: preparation
sense: 07041429-n
part of speech: noun

07041429-n
type: LexicalConcept
in scheme: en-word.net
definition: (music) a note that produces a dissonant chord is first heard in a consonant chord
example: the resolution of one dissonance is often the preparation for another dissonance
ili: i73585
lexfile: noun.communication
part of speech: noun
domain topic: 07034009-n
hypernym: 07040667-n