cue-n
type: LexicalEntry
canonical form: cue
sense: 07024325-n
part of speech: noun

07024325-n
type: LexicalConcept
in scheme: en-word.net
definition: an actor's line that immediately precedes and serves as a reminder for some action or speech
ili: i73505
lexfile: noun.communication
part of speech: noun
hypernym: 07023937-n