plot-n
type: LexicalEntry
canonical form: plot
sense: 07012805-n
part of speech: noun

07012805-n
type: LexicalConcept
in scheme: en-word.net
definition: a chart or graph showing the movements or progress of an object
ili: i73444
lexfile: noun.communication
part of speech: noun
hypernym: 07012462-n