illustration-n
type: LexicalEntry
canonical form: illustration
sense: 07011893-n
part of speech: noun

07011893-n
type: LexicalConcept
in scheme: en-word.net
definition: artwork that helps make something clear or attractive
ili: i73440
lexfile: noun.communication
part of speech: noun
hypernym: 07011408-n
mero part: 06358261-n