Russian-n
type: LexicalEntry
canonical form: Russian
sense: 06957110-n
part of speech: noun

Russian language-n
type: LexicalEntry
canonical form: Russian language
sense: 06957110-n
part of speech: noun

06957110-n
type: LexicalConcept
in scheme: en-word.net
definition: the Slavic language that is the official language of Russia
ili: i73087
lexfile: noun.communication
part of speech: noun
domain region: 09025654-n
hypernym: 06956533-n