upgrade-n
type: LexicalEntry
canonical form: upgrade
sense: 06916031-n
part of speech: noun

06916031-n
type: LexicalConcept
in scheme: en-word.net
definition: software that provides better performance than an earlier version did
ili: i72790
lexfile: noun.communication
part of speech: noun
hypernym: 06578068-n