C-n
type: LexicalEntry
canonical form: C
sense: 06915472-n
part of speech: noun

06915472-n
type: LexicalConcept
in scheme: en-word.net
definition: a general-purpose programing language closely associated with the UNIX operating system
ili: i72786
lexfile: noun.communication
part of speech: noun
hypernym: 06911128-n