identification-n
type: LexicalEntry
canonical form: identification
sense: 06898133-n
part of speech: noun

06898133-n
type: LexicalConcept
in scheme: en-word.net
definition: evidence of identity; something that identifies a person or thing
ili: i72683
lexfile: noun.communication
part of speech: noun
hypernym: 06656171-n