re-n
type: LexicalEntry
canonical form: re
sense: 06881495-n
part of speech: noun

ray-n
type: LexicalEntry
canonical form: ray
sense: 06881495-n
part of speech: noun

06881495-n
type: LexicalConcept
in scheme: en-word.net
definition: the syllable naming the second (supertonic) note of any major scale in solmization
ili: i72578
lexfile: noun.communication
part of speech: noun
hypernym: 06881093-n