key-n
type: LexicalEntry
canonical form: key
sense: 06876801-n
part of speech: noun

tonality-n
type: LexicalEntry
canonical form: tonality
sense: 06876801-n
part of speech: noun

06876801-n
type: LexicalConcept
in scheme: en-word.net
definition: any of 24 major or minor diatonic scales that provide the tonal framework for a piece of music
ili: i72552
lexfile: noun.communication
part of speech: noun
hypernym: 06827728-n