mode-n
type: LexicalEntry
canonical form: mode
sense: 06874680-n
part of speech: noun

musical mode-n
type: LexicalEntry
canonical form: musical mode
sense: 06874680-n
part of speech: noun

06874680-n
type: LexicalConcept
in scheme: en-word.net
definition: any of various fixed orders of the various diatonic notes within an octave
ili: i72539
lexfile: noun.communication
part of speech: noun
hypernym: 06873373-n