revenue stamp-n
type: LexicalEntry
canonical form: revenue stamp
sense: 06868867-n
part of speech: noun

stamp-n
type: LexicalEntry
canonical form: stamp
sense: 06868867-n
part of speech: noun

06868867-n
type: LexicalConcept
in scheme: en-word.net
definition: a small piece of adhesive paper that is put on an object to show that a government tax has been paid
ili: i72502
lexfile: noun.communication
part of speech: noun
hypernym: 06266354-n