parenthesis-n
type: LexicalEntry
canonical form: parenthesis
sense: 06856443-n
part of speech: noun

06856443-n
type: LexicalConcept
in scheme: en-word.net
definition: either of two punctuation marks ‘(’ or ‘)’ used to enclose textual material
ili: i72482
lexfile: noun.communication
part of speech: noun
hypernym: 06854415-n