hyphen-n
type: LexicalEntry
canonical form: hyphen
sense: 06856198-n
part of speech: noun

dash-n
type: LexicalEntry
canonical form: dash
sense: 06856198-n
part of speech: noun

06856198-n
type: LexicalConcept
in scheme: en-word.net
definition: a punctuation mark (‘-’) used between parts of a compound word or between the syllables of a word when the word is divided at the end of a line of text
ili: i72481
lexfile: noun.communication
part of speech: noun
hypernym: 06854415-n