radical-n
type: LexicalEntry
canonical form: radical
sense: 06854209-n
part of speech: noun

06854209-n
type: LexicalConcept
in scheme: en-word.net
definition: a character conveying the lexical meaning of a logogram
ili: i72470
lexfile: noun.communication
part of speech: noun
hypernym: 06831828-n