characteristic-n
type: LexicalEntry
canonical form: characteristic
sense: 06826168-n
part of speech: noun

06826168-n
type: LexicalConcept
in scheme: en-word.net
definition: the integer part (positive or negative) of the representation of a logarithm; in the expression ‘log 643 = 2.808’ the characteristic is 2
ili: i72300
lexfile: noun.communication
part of speech: noun
hypernym: 13750609-n