dash-n
type: LexicalEntry
canonical form: dash
sense: 06818820-n
part of speech: noun

dah-n
type: LexicalEntry
canonical form: dah
sense: 06818820-n
part of speech: noun

06818820-n
type: LexicalConcept
in scheme: en-word.net
definition: the longer of the two telegraphic signals used in Morse code
ili: i72258
lexfile: noun.communication
part of speech: noun
hypernym: 06818523-n