graduation-n
type: LexicalEntry
canonical form: graduation
sense: 06814823-n
part of speech: noun

06814823-n
type: LexicalConcept
in scheme: en-word.net
definition: a line (as on a vessel or ruler) that marks a measurement
example: the ruler had 16 graduations per inch
ili: i72231
lexfile: noun.communication
part of speech: noun
hypernym: 06812755-n