rule-n
type: LexicalEntry
canonical form: rule
sense: 06801754-n
part of speech: noun

06801754-n
type: LexicalConcept
in scheme: en-word.net
definition: directions that define the way a game or sport is to be conducted
example: he knew the rules of chess
ili: i72163
lexfile: noun.communication
part of speech: noun
hypernym: 06799486-n