indenture-n
type: LexicalEntry
canonical form: indenture
sense: 06785807-n
part of speech: noun

06785807-n
type: LexicalConcept
in scheme: en-word.net
definition: formal agreement between the issuer of bonds and the bondholders as to terms of the debt
ili: i72080
lexfile: noun.communication
part of speech: noun
hypernym: 06784454-n