indenture-n
type: LexicalEntry
canonical form: indenture
sense: 06785638-n
part of speech: noun

06785638-n
type: LexicalConcept
in scheme: en-word.net
definition: a contract binding one party into the service of another for a specified term
ili: i72079
lexfile: noun.communication
part of speech: noun
hypernym: 06532935-n