submission-n
type: LexicalEntry
canonical form: submission
sense: 06784758-n
part of speech: noun

06784758-n
type: LexicalConcept
in scheme: en-word.net
definition: an agreement between parties in a dispute to abide by the decision of an arbiter
ili: i72074
lexfile: noun.communication
part of speech: noun
hypernym: 06783066-n