fraudulence-n
type: LexicalEntry
canonical form: fraudulence
sense: 06773680-n
part of speech: noun

duplicity-n
type: LexicalEntry
canonical form: duplicity
sense: 06773680-n
part of speech: noun

06773680-n
type: LexicalConcept
in scheme: en-word.net
definition: a fraudulent or duplicitous representation
ili: i72021
lexfile: noun.communication
part of speech: noun
hypernym: 06770936-n