facade-n
type: LexicalEntry
canonical form: facade
sense: 06771409-n
part of speech: noun

window dressing-n
type: LexicalEntry
canonical form: window dressing
sense: 06771409-n
part of speech: noun

06771409-n
type: LexicalConcept
in scheme: en-word.net
definition: a showy misrepresentation intended to conceal something unpleasant
ili: i72009
lexfile: noun.communication
part of speech: noun
hypernym: 06770936-n