quotation-n
type: LexicalEntry
canonical form: quotation
sense: 06768978-n
part of speech: noun

06768978-n
type: LexicalConcept
in scheme: en-word.net
definition: a statement of the current market price of a security or commodity
ili: i71996
lexfile: noun.communication
part of speech: noun
hypernym: 06735202-n